Target
Polyunsaturated fatty acid 5-lipoxygenase
Ligand
BDBM50006803
Substrate
Meas. Tech.
ChEMBL_163797 (CHEMBL772970)
IC50
62±n/a nM
Citation
 Ohkawa, STerao, STerashita, ZShibouta, YNishikawa, K Dual inhibitors of thromboxane A2 synthase and 5-lipoxygenase with scavenging activity of active oxygen species. Synthesis of a novel series of (3-pyridylmethyl)benzoquinone derivatives. J Med Chem 34:267-76 (1991)  
Target
Name:
Polyunsaturated fatty acid 5-lipoxygenase
Synonyms:
Alox5 LOX5_RAT
Type:
PROTEIN
Mol. Mass.:
78082.31
Organism:
Rattus norvegicus
Description:
ChEMBL_1432947
Residue:
673
  
Inhibitor
Name:
BDBM50006803
Synonyms:
2,3,5-Trimethyl-6-pyridin-3-ylmethyl-[1,4]benzoquinone CV-6504
Type:
Small organic molecule
Emp. Form.:
C15H15NO2
Mol. Mass.:
241.2851
SMILES:
Cc1c(O)c(=Cc2cccnc2)c(C)c(O)c1=C
: