Target
Thromboxane-A synthase
Ligand
BDBM50010961
Substrate
Meas. Tech.
ChEBML_209772
IC50
490±n/a nM
Citation
 Ohkawa, STerao, STerashita, ZShibouta, YNishikawa, K Dual inhibitors of thromboxane A2 synthase and 5-lipoxygenase with scavenging activity of active oxygen species. Synthesis of a novel series of (3-pyridylmethyl)benzoquinone derivatives. J Med Chem 34:267-76 (1991)  
Target
Name:
Thromboxane-A synthase
Synonyms:
CYP5 Cytochrome P450 5A1 TBXAS1 TXA synthase TXS Thromboxane A2 Synthase (P450 TxA2) Thromboxane prostanoid Thromboxane-A synthase
Type:
Enzyme
Mol. Mass.:
60524.67
Organism:
Homo sapiens (Human)
Description:
P24557
Residue:
533
  
Inhibitor
Name:
BDBM50010961
Synonyms:
2-Methyl-3-pyridin-3-ylmethyl-[1,4]naphthoquinone | CHEMBL92863
Type:
Small organic molecule
Emp. Form.:
C17H13NO2
Mol. Mass.:
263.2906
SMILES:
CC1=C(Cc2cccnc2)C(=O)c2ccccc2C1=O
: