Target
Histone deacetylase 6
Ligand
BDBM50263482
Substrate
Meas. Tech.
ChEBML_1697937
Ki
0.480000±n/a nM
Citation
 Sellmer, AStangl, HBeyer, MGrünstein, ELeonhardt, MPongratz, HEichhorn, EElz, SStriegl, BJenei-Lanzl, ZDove, SStraub, RHKrämer, OHMahboobi, S Marbostat-100 Defines a New Class of Potent and Selective Antiinflammatory and Antirheumatic Histone Deacetylase 6 Inhibitors. J Med Chem 61:3454-3477 (2018)  
Target
Name:
Histone deacetylase 6
Synonyms:
Cereblon/Histone deacetylase 6 HDAC6 Histone deacetylase 6 (HDAC6) KIAA0901 | ORF Names:JM21
Type:
Chromatin regulator; hydrolase; repressor
Mol. Mass.:
131381.51
Organism:
Homo sapiens (Human)
Description:
Q9UBN7
Residue:
1215
  
Inhibitor
Name:
BDBM50263482
Synonyms:
CHEMBL4072045
Type:
Small organic molecule
Emp. Form.:
C28H32ClN5O6
Mol. Mass.:
570.037
SMILES:
Cl.CN1C(=O)C2CN(Cc3c2c2cc(OCCN4CCOCC4)ccc2n3Cc2ccc(cc2)C(=O)NO)C1=O
: