Target
Platelet-activating factor receptor
Ligand
BDBM50011049
Substrate
Meas. Tech.
ChEBML_177423
IC50
72±n/a nM
Citation
 Bartrolí, JCarceller, EMerlos, MGarcía-Rafanell, JForn, J Disubstituted tetrahydrofurans and dioxolanes and PAF antagonists. J Med Chem 34:373-86 (1991)  
Target
Name:
Platelet-activating factor receptor
Synonyms:
PAF-R PTAFR_CAVPO Platelet-activating factor receptor
Type:
Protein
Mol. Mass.:
39005.63
Organism:
Cavia porcellus
Description:
Residue:
342
  
Inhibitor
Name:
BDBM50011049
Synonyms:
CHEMBL124394 | Tetrahydrofuran derivative
Type:
Small organic molecule
Emp. Form.:
C33H56N3O6
Mol. Mass.:
590.8137
SMILES:
CCCCCCCCCCCCCCCNOC(=O)CC1CCC(COC(=O)N(Cc2cccc[n+]2CC)C(C)=O)O1
: