Target
Platelet-activating factor receptor
Ligand
BDBM50011048
Substrate
Meas. Tech.
ChEBML_177423
IC50
8000±n/a nM
Citation
 Bartrolí, JCarceller, EMerlos, MGarcía-Rafanell, JForn, J Disubstituted tetrahydrofurans and dioxolanes and PAF antagonists. J Med Chem 34:373-86 (1991)  
Target
Name:
Platelet-activating factor receptor
Synonyms:
PAF-R PTAFR_CAVPO Platelet-activating factor receptor
Type:
Protein
Mol. Mass.:
39005.63
Organism:
Cavia porcellus
Description:
Residue:
342
  
Inhibitor
Name:
BDBM50011048
Synonyms:
1-Ethyl-4-[(4-octadecyloxymethyl-tetrahydro-furan-2-ylmethoxycarbonylamino)-methyl]-pyridinium; iodide | CHEMBL419786
Type:
Small organic molecule
Emp. Form.:
C33H59N2O4
Mol. Mass.:
547.832
SMILES:
1COC(COC(=O)NCc2cc[n+](CC)cc2)C1
: