Target
Platelet-activating factor receptor
Ligand
BDBM50005232
Substrate
Meas. Tech.
ChEMBL_177423 (CHEMBL784402)
IC50
11±n/a nM
Citation
 Bartrolí, JCarceller, EMerlos, MGarcía-Rafanell, JForn, J Disubstituted tetrahydrofurans and dioxolanes and PAF antagonists. J Med Chem 34:373-86 (1991)  
Target
Name:
Platelet-activating factor receptor
Synonyms:
PAF-R PTAFR_CAVPO Platelet-activating factor receptor
Type:
Protein
Mol. Mass.:
39005.63
Organism:
Cavia porcellus
Description:
Residue:
342
  
Inhibitor
Name:
BDBM50005232
Synonyms:
(R)-2-{[Acetyl-(2-methoxy-3-octadecylcarbamoyloxy-propoxycarbonyl)-amino]-methyl}-1-ethyl-pyridinium; chloride 2-{[Acetyl-(2-methoxy-3-octadecylcarbamoyloxy-propoxycarbonyl)-amino]-methyl}-1-ethyl-pyridinium; chloride CHEMBL274420 | CV-6209
Type:
Small organic molecule
Emp. Form.:
C34H60N3O6
Mol. Mass.:
606.8562
SMILES:
(=O)OCC(COC(=O)N(Cc1cccc[n+]1CC)C(C)=O)OC
: