Target
Platelet-activating factor receptor
Ligand
BDBM50011063
Substrate
Meas. Tech.
ChEBML_177423
IC50
9200±n/a nM
Citation
 Bartrolí, JCarceller, EMerlos, MGarcía-Rafanell, JForn, J Disubstituted tetrahydrofurans and dioxolanes and PAF antagonists. J Med Chem 34:373-86 (1991)  
Target
Name:
Platelet-activating factor receptor
Synonyms:
PAF-R PTAFR_CAVPO Platelet-activating factor receptor
Type:
Protein
Mol. Mass.:
39005.63
Organism:
Cavia porcellus
Description:
Residue:
342
  
Inhibitor
Name:
BDBM50011063
Synonyms:
CHEMBL262465 | Toluene-4-sulfonate3-[5-(4-octadecyloxymethyl-tetrahydro-furan-2-ylmethoxycarbonyl)-pentyl]-thiazol-3-ium;Toluene-4-sulfonate
Type:
Small organic molecule
Emp. Form.:
C33H60NO4S
Mol. Mass.:
566.898
SMILES:
1COC(COC(=O)CCCCC[n+]2ccsc2)C1
: