Target
Platelet-activating factor receptor
Ligand
BDBM50011127
Substrate
Meas. Tech.
ChEBML_177423
IC50
27±n/a nM
Citation
 Bartrolí, JCarceller, EMerlos, MGarcía-Rafanell, JForn, J Disubstituted tetrahydrofurans and dioxolanes and PAF antagonists. J Med Chem 34:373-86 (1991)  
Target
Name:
Platelet-activating factor receptor
Synonyms:
PAF-R PTAFR_CAVPO Platelet-activating factor receptor
Type:
Protein
Mol. Mass.:
39005.63
Organism:
Cavia porcellus
Description:
Residue:
342
  
Inhibitor
Name:
BDBM50011127
Synonyms:
CHEMBL338345 | Tetrahydrofuran derivative
Type:
Small organic molecule
Emp. Form.:
C35H60N3O6
Mol. Mass.:
618.8669
SMILES:
(=O)CC1COC(COC(=O)N(Cc2cccc[n+]2CC)C(C)=O)C1
: