Target
Platelet-activating factor receptor
Ligand
BDBM50011052
Substrate
Meas. Tech.
ChEBML_177423
IC50
2100±n/a nM
Citation
 Bartrolí, JCarceller, EMerlos, MGarcía-Rafanell, JForn, J Disubstituted tetrahydrofurans and dioxolanes and PAF antagonists. J Med Chem 34:373-86 (1991)  
Target
Name:
Platelet-activating factor receptor
Synonyms:
PAF-R PTAFR_CAVPO Platelet-activating factor receptor
Type:
Protein
Mol. Mass.:
39005.63
Organism:
Cavia porcellus
Description:
Residue:
342
  
Inhibitor
Name:
BDBM50011052
Synonyms:
CHEMBL124535 | Toluene-4-sulfonate3-[6-(4-tetradecyl-tetrahydro-furan-2-ylmethoxy)-hexyl]-thiazol-3-ium;Toluene-4-sulfonate
Type:
Small organic molecule
Emp. Form.:
C28H52NO2S
Mol. Mass.:
466.782
SMILES:
CCCCCCCCCCCCCCC1COC(COCCCCCC[n+]2ccsc2)C1
: