Target
Adenosine receptor A1
Ligand
BDBM50011214
Substrate
Meas. Tech.
ChEMBL_29295 (CHEMBL640356)
Ki
>100000±n/a nM
Citation
 Shimada, JSuzuki, FNonaka, HKarasawa, AMizumoto, HOhno, TKubo, KIshii, A 8-(Dicyclopropylmethyl)-1,3-dipropylxanthine: a potent and selective adenosine A1 antagonist with renal protective and diuretic activities. J Med Chem 34:466-9 (1991)  
Target
Name:
Adenosine receptor A1
Synonyms:
A1 adenosine receptor ADENOSINE A1 ADENOSINE A1 low Adenosine A1 receptor | Adenosine Receptor A1
Type:
Enzyme Catalytic Domain
Mol. Mass.:
36501.39
Organism:
GUINEA PIG
Description:
ADENOSINE A1 ADORA1 GUINEA PIG::P47745
Residue:
326
  
Inhibitor
Name:
BDBM50011214
Synonyms:
8-Dicyclohexylmethyl-1,3-dipropyl-3,7-dihydro-purine-2,6-dione | CHEMBL142576
Type:
Small organic molecule
Emp. Form.:
C24H38N4O2
Mol. Mass.:
414.5841
SMILES:
CCCn1c2nc([nH]c2c(=O)n(CCC)c1=O)C(C1CCCCC1)C1CCCCC1
: