Target
Renin
Ligand
BDBM50406473
Substrate
Meas. Tech.
ChEBML_195778
IC50
1.9±n/a nM
Citation
 Thaisrivongs, SPals, DTDuCharme, DWTurner, SRDeGraaf, GLLawson, JACouch, SJWilliams, MV Renin inhibitory peptides. Incorporation of polar, hydrophilic end groups into an active renin inhibitory peptide template and their evaluation in a human renin infused rat model and in conscious sodium-depleted monkeys. J Med Chem 34:633-42 (1991)  
Target
Name:
Renin
Synonyms:
Angiotensinogenase RENI_HUMAN
Type:
Enzyme
Mol. Mass.:
45058.99
Organism:
Homo sapiens (Human)
Description:
Residue:
406
  
Inhibitor
Name:
BDBM50406473
Synonyms:
CHEMBL2028947
Type:
Small organic molecule
Emp. Form.:
C49H74N9O12P
Mol. Mass.:
1012.1387
SMILES:
CC[C@H](C)[C@H](NC(=O)[C@@H](CC(O)[C@H](CC(C)C)NC(=O)[C@H](Cc1cnc[nH]1)N(C)C(=O)[C@H](Cc1ccccc1)NC(=O)[C@@H]1CCCN1C(=O)CCCO[P+](O)(O)[O-])C(C)C)C(=O)NCc1cccc[n+]1[O-]
: