Target
Tyrosine-protein kinase Lck
Ligand
BDBM50011436
Substrate
Meas. Tech.
ChEBML_210731
IC50
>2000000±n/a nM
Citation
 Cushman, MNagarathnam, DBurg, DLGeahlen, RL Synthesis and protein-tyrosine kinase inhibitory activities of flavonoid analogues. J Med Chem 34:798-806 (1991)  
Target
Name:
Tyrosine-protein kinase Lck
Synonyms:
2.7.10.2 LCK_HUMAN Leukocyte C-terminal Src kinase Lymphocyte-specific protein tyrosine kinase Protein YT16 Proto-oncogene tyrosine-protein kinase LCK T cell-specific protein-tyrosine kinase
Type:
Mol. Mass.:
57987.83
Organism:
Homo sapiens (Human)
Description:
P06239
Residue:
509
  
Inhibitor
Name:
BDBM50011436
Synonyms:
5,7-Dihydroxy-2-(4-nitro-phenyl)-4-oxo-4H-chromene-3-carboxylic acid | CHEMBL167834
Type:
Small organic molecule
Emp. Form.:
C16H9NO8
Mol. Mass.:
343.2446
SMILES:
OC(=O)c1c([O-])c2c(cc(O)cc2=[OH+])oc1-c1ccc(cc1)[N+]([O-])=O
: