Target
Gag-Pol polyprotein [489-587]
Ligand
BDBM50011688
Substrate
Meas. Tech.
ChEBML_158641
IC50
16±n/a nM
Citation
 Rich, DHSun, CQVara Prasad, JVPathiasseril, AToth, MVMarshall, GRClare, MMueller, RAHouseman, K Effect of hydroxyl group configuration in hydroxyethylamine dipeptide isosteres on HIV protease inhibition. Evidence for multiple binding modes. J Med Chem 34:1222-5 (1991)  
Target
Name:
Gag-Pol polyprotein [489-587]
Synonyms:
Human immunodeficiency virus type 1 protease Pol polyprotein | gag-pol
Type:
Enzyme Subunit
Mol. Mass.:
10781.16
Organism:
Human immunodeficiency virus type 1
Description:
P04585[489-587]
Residue:
99
  
Inhibitor
Name:
BDBM50011688
Synonyms:
Boc-Asn-Phe-HEA(R)-Pro-Ile-Val-OMe | CHEMBL3349554
Type:
Small organic molecule
Emp. Form.:
C36H58N6O9
Mol. Mass.:
718.8805
SMILES:
CC[C@H](C)[C@H](NC(=O)[C@@H]1CCCN1C[C@H](O)[C@H](Cc1ccccc1)NC(=O)[C@H](CC(N)=O)NC(=O)OC(C)(C)C)C(=O)N[C@@H](C(C)C)C(=O)OC
: