Target
Platelet-activating factor receptor
Ligand
BDBM50011858
Substrate
Meas. Tech.
ChEBML_154999
IC50
180±n/a nM
Citation
 Walser, AFlynn, TMason, CCrowley, HMaresca, CO'Donnell, M Thienotriazolodiazepines as platelet-activating factor antagonists. Steric limitations for the substituent in position 2. J Med Chem 34:1440-6 (1991)  
Target
Name:
Platelet-activating factor receptor
Synonyms:
PAF Platelet activating factor PAFR PTAFR_HUMAN Platelet-activating factor receptor
Type:
Enzyme Catalytic Domain
Mol. Mass.:
39219.60
Organism:
Homo sapiens (Human)
Description:
PAF Platelet activating factor PTAFR HUMAN::P25105
Residue:
342
  
Inhibitor
Name:
BDBM50011858
Synonyms:
3-[4-(2-Chloro-phenyl)-9-methyl-6H-1-thia-5,7,8,9a-tetraaza-cyclopenta[e]azulen-2-yl]-prop-2-yn-1-ol | CHEMBL32327
Type:
Small organic molecule
Emp. Form.:
C18H13ClN4OS
Mol. Mass.:
368.84
SMILES:
Cc1nnc2CN=C(c3cc(sc3-n12)C#CCO)c1ccccc1Cl
: