Target
Platelet-activating factor receptor
Ligand
BDBM50011879
Substrate
Meas. Tech.
ChEBML_154999
IC50
100±n/a nM
Citation
 Walser, AFlynn, TMason, CCrowley, HMaresca, CO'Donnell, M Thienotriazolodiazepines as platelet-activating factor antagonists. Steric limitations for the substituent in position 2. J Med Chem 34:1440-6 (1991)  
Target
Name:
Platelet-activating factor receptor
Synonyms:
PAF Platelet activating factor PAFR PTAFR_HUMAN Platelet-activating factor receptor
Type:
Enzyme Catalytic Domain
Mol. Mass.:
39219.60
Organism:
Homo sapiens (Human)
Description:
PAF Platelet activating factor PTAFR HUMAN::P25105
Residue:
342
  
Inhibitor
Name:
BDBM50011879
Synonyms:
4-(2-Chloro-phenyl)-2-[2-(4-imidazol-1-yl-phenyl)-ethyl]-9-methyl-6H-1-thia-5,7,8,9a-tetraaza-cyclopenta[e]azulene | CHEMBL369194
Type:
Small organic molecule
Emp. Form.:
C26H21ClN6S
Mol. Mass.:
485.003
SMILES:
Cc1nnc2CN=C(c3cc(CCc4ccc(cc4)-n4ccnc4)sc3-n12)c1ccccc1Cl
: