Target
Muscarinic acetylcholine receptor M4
Ligand
BDBM50240552
Substrate
Meas. Tech.
ChEMBL_1704863 (CHEMBL4056096)
Ki
0.640000±n/a nM
Citation
 Bender, AMWeiner, RLLuscombe, VBAjmera, SCho, HPChang, SZhan, XRodriguez, ALNiswender, CMEngers, DWBridges, TMConn, PJLindsley, CW Discovery and optimization of 3-(4-aryl/heteroarylsulfonyl)piperazin-1-yl)-6-(piperidin-1-yl)pyridazines as novel, CNS penetrant pan-muscarinic antagonists. Bioorg Med Chem Lett 27:3576-3581 (2017)  
Target
Name:
Muscarinic acetylcholine receptor M4
Synonyms:
ACM4_HUMAN Cholinergic, muscarinic M4 Muscarinic acetylcholine receptor M2 and M4
Type:
Enzyme Catalytic Domain
Mol. Mass.:
53079.31
Organism:
Homo sapiens (Human)
Description:
Cholinergic, muscarinic M4 CHRM4 HUMAN M3::P08173
Residue:
479
  
Inhibitor
Name:
BDBM50240552
Synonyms:
CHEMBL195
Type:
Small organic molecule
Emp. Form.:
C17H23NO3
Mol. Mass.:
289.3694
SMILES:
[H][C@@]12CC[C@]([H])(CC(C1)OC(=O)C(CO)c1ccccc1)N2C
: