Target
Renin
Ligand
BDBM50012936
Substrate
Meas. Tech.
ChEBML_195780
IC50
212±n/a nM
Citation
 Bradbury, RHMajor, JSOldham, AARivett, JERoberts, DASlater, AMTimms, DWaterson, D 1,2,4-Triazolo[4,3-a]pyrazine derivatives with human renin inhibitory activity. 2. Synthesis, biological properties and molecular modeling of hydroxyethylene isostere derivatives. J Med Chem 33:2335-42 (1990)  
Target
Name:
Renin
Synonyms:
Angiotensinogenase RENI_HUMAN
Type:
Enzyme
Mol. Mass.:
45058.99
Organism:
Homo sapiens (Human)
Description:
Residue:
406
  
Inhibitor
Name:
BDBM50012936
Synonyms:
6-Cyclohexyl-4-hydroxy-2-isopropyl-5-[2-(8-propyl-6-pyridin-3-yl-[1,2,4]triazolo[4,3-a]pyrazin-3-yl)-3-pyridin-3-yl-propionylamino]-hexanoic acid (2-dimethylamino-ethyl)-methyl-amide | CHEMBL78096
Type:
Small organic molecule
Emp. Form.:
C41H59N9O3
Mol. Mass.:
725.9657
SMILES:
CCCc1nc(cn2c(nnc12)C(Cc1cccnc1)C(=O)NC(CC1CCCCC1)C(O)CC(C(C)C)C(=O)N(C)CCN(C)C)-c1cccnc1
: