Target
5-hydroxytryptamine receptor 2A/2B/2C
Ligand
BDBM50012980
Substrate
Meas. Tech.
ChEMBL_2124 (CHEMBL617208)
Ki
23000±n/a nM
Citation
 Schlecht, MFTsarouhtsis, DLipovac, MNDebler, EA Synthesis and serotonin binding site studies of some conformationally restricted indolylethylamine analogues based on 2-amino-3-(3'-indolyl)bicyclo[2.2.2]octane. J Med Chem 33:386-94 (1990)  
Target
Name:
5-hydroxytryptamine receptor 2A/2B/2C
Synonyms:
Serotonin 2 (5-HT2) receptor
Type:
Mol. Mass.:
Description:
ASSAY_ID of ChEMBL is 2124
Components:
This complex has 3 components.
Component 1
Name:
5-hydroxytryptamine receptor 2C
Synonyms:
5-HT2C 5-hydroxytryptamine receptor 2C (5HT2C) 5ht1c Htr1c Serotonin 2c (5-HT2c) receptor
Type:
Enzyme
Mol. Mass.:
51948.16
Organism:
Mus musculus (Mouse)
Description:
P34968
Residue:
459
  
Component 2
Name:
5-hydroxytryptamine receptor 2A
Synonyms:
5-HT-2 5-hydroxytryptamine receptor 2A 5HT2A_MOUSE Htr2 Serotonin 2a (5-HT2a) receptor
Type:
Enzyme
Mol. Mass.:
52843.00
Organism:
Mus musculus (Mouse)
Description:
P35363
Residue:
471
  
Component 3
Name:
5-hydroxytryptamine receptor 2B
Synonyms:
5-HT2 5-hydroxytryptamine receptor 2B 5HT2B_MOUSE Htr2b
Type:
Enzyme
Mol. Mass.:
53610.91
Organism:
Mus musculus (Mouse)
Description:
Q02152
Residue:
479
  
Inhibitor
Name:
BDBM50012980
Synonyms:
5-(1H-Indol-3-yl)-6-pyrrolidin-1-yl-bicyclo[2.2.2]octan-2-one | CHEMBL128329
Type:
Small organic molecule
Emp. Form.:
C20H24N2O
Mol. Mass.:
308.4174
SMILES:
O=C1CC2CCC1C(C2c1c[nH]c2ccccc12)N1CCCC1
: