Target
3-hydroxy-3-methylglutaryl-coenzyme A reductase
Ligand
BDBM50013221
Substrate
Meas. Tech.
ChEMBL_80661 (CHEMBL691946)
IC50
100±n/a nM
Citation
 Jendralla, HBaader, EBartmann, WBeck, GBergmann, AGranzer, Evon Kerekjarto, BKesseler, KKrause, RSchubert, W Synthesis and biological activity of new HMG-CoA reductase inhibitors. 2. Derivatives of 7-(1H-pyrrol-3-yl)-substituted-3,5-dihydroxyhept-6(E)-enoic (-heptanoic) acids. J Med Chem 33:61-70 (1990)  
Target
Name:
3-hydroxy-3-methylglutaryl-coenzyme A reductase
Synonyms:
HMDH_RAT Hmgcr
Type:
Enzyme
Mol. Mass.:
96689.85
Organism:
Rattus norvegicus (rat)
Description:
Isolated rat liver microsomes were used as enzyme source.
Residue:
887
  
Inhibitor
Name:
BDBM50013221
Synonyms:
CHEMBL163277 | Sodium salt of7-[4-(4-Fluoro-phenyl)-1-isopropyl-2-methyl-1H-pyrrol-3-yl]-3,5-dihydroxy-heptanoic acid
Type:
Small organic molecule
Emp. Form.:
C21H27FNO4
Mol. Mass.:
376.4423
SMILES:
CC(C)n1cc(c(CC[C@@H](O)C[C@@H](O)CC([O-])=O)c1C)-c1ccc(F)cc1
: