Target
Mitogen-activated protein kinase kinase kinase 12
Ligand
BDBM50271220
Substrate
Meas. Tech.
ChEMBL_1709818 (CHEMBL4119867)
Ki
6.0±n/a nM
Citation
 Patel, SMeilandt, WJErickson, RIChen, JDeshmukh, GEstrada, AAFuji, RNGibbons, PGustafson, AHarris, SFImperio, JLiu, WLiu, XLiu, YLyssikatos, JPMa, CYin, JLewcock, JWSiu, M Selective Inhibitors of Dual Leucine Zipper Kinase (DLK, MAP3K12) with Activity in a Model of Alzheimer's Disease. J Med Chem 60:8083-8102 (2017)  
Target
Name:
Mitogen-activated protein kinase kinase kinase 12
Synonyms:
DLK Leucine-zipper protein kinase MAP3K12 MUK Mixed lineage kinase | ZPK
Type:
PROTEIN
Mol. Mass.:
93216.56
Organism:
Homo sapiens (Human)
Description:
ChEMBL_1460553
Residue:
859
  
Inhibitor
Name:
BDBM50271220
Synonyms:
CHEMBL3718265
Type:
Small organic molecule
Emp. Form.:
C19H22F3N5O
Mol. Mass.:
393.4061
SMILES:
[H][C@@]12CN(C[C@]1([H])[C@H]2c1cc(nn1C(C)C)-c1cnc(N)c(c1)C(F)(F)F)C(C)=O
: