Target
Mitogen-activated protein kinase kinase kinase 12
Ligand
BDBM50271241
Substrate
Meas. Tech.
ChEMBL_1709818 (CHEMBL4119867)
Ki
4.0±n/a nM
Citation
 Patel, SMeilandt, WJErickson, RIChen, JDeshmukh, GEstrada, AAFuji, RNGibbons, PGustafson, AHarris, SFImperio, JLiu, WLiu, XLiu, YLyssikatos, JPMa, CYin, JLewcock, JWSiu, M Selective Inhibitors of Dual Leucine Zipper Kinase (DLK, MAP3K12) with Activity in a Model of Alzheimer's Disease. J Med Chem 60:8083-8102 (2017)  
Target
Name:
Mitogen-activated protein kinase kinase kinase 12
Synonyms:
DLK Leucine-zipper protein kinase MAP3K12 MUK Mixed lineage kinase | ZPK
Type:
PROTEIN
Mol. Mass.:
93216.56
Organism:
Homo sapiens (Human)
Description:
ChEMBL_1460553
Residue:
859
  
Inhibitor
Name:
BDBM50271241
Synonyms:
CHEMBL3718912
Type:
Small organic molecule
Emp. Form.:
C22H29N5O
Mol. Mass.:
379.4986
SMILES:
CC(C)n1nc(cc1C1CCN(CC1)C1COC1)-c1cnc2[nH]cc(C)c2c1
: