Target
Nuclear receptor ROR-beta
Ligand
BDBM50271665
Substrate
Meas. Tech.
ChEBML_1711299
IC50
53±n/a nM
Citation
 Gege, CCummings, MDAlbers, MKinzel, OKleymann, GSchlüter, TSteeneck, CNelen, MIMilligan, CSpurlino, JXue, XLeonard, KEdwards, JPFourie, AGoldberg, SDHoffmann, T Identification and biological evaluation of thiazole-based inverse agonists of ROR?t. Bioorg Med Chem Lett 28:1446-1455 (2018)  
Target
Name:
Nuclear receptor ROR-beta
Synonyms:
NR1F2 Nuclear receptor subfamily 1 group F member 2 RORB_HUMAN Retinoid-related orphan receptor-beta
Type:
PROTEIN
Mol. Mass.:
53227.30
Organism:
Homo sapiens (Human)
Description:
ChEMBL_107979
Residue:
470
  
Inhibitor
Name:
BDBM50271665
Synonyms:
CHEMBL4126690
Type:
Small organic molecule
Emp. Form.:
C29H34F6N2O4S
Mol. Mass.:
620.647
SMILES:
CC(C)(C)c1cc(cc(c1)C(O)(C(F)(F)F)C(F)(F)F)-c1sc(nc1CC1CCCCC1)C(=O)N[C@H]1C[C@@H](C1)C(O)=O
: