Target
Nuclear receptor ROR-gamma
Ligand
BDBM392102
Substrate
Meas. Tech.
ChEMBL_1711300 (CHEMBL4121349)
IC50
1.2±n/a nM
Citation
 Gege, CCummings, MDAlbers, MKinzel, OKleymann, GSchlüter, TSteeneck, CNelen, MIMilligan, CSpurlino, JXue, XLeonard, KEdwards, JPFourie, AGoldberg, SDHoffmann, T Identification and biological evaluation of thiazole-based inverse agonists of ROR?t. Bioorg Med Chem Lett 28:1446-1455 (2018)  
Target
Name:
Nuclear receptor ROR-gamma
Synonyms:
NR1F3 Nuclear receptor ROR-gamma (RORC) RAR-related orphan receptor C (RORc) RORG RZRG Retinoid-related orphan receptor-gamma (RORc)
Type:
Enzyme Catalytic Domain
Mol. Mass.:
58218.40
Organism:
Homo sapiens (Human)
Description:
P51449
Residue:
518
  
Inhibitor
Name:
BDBM392102
Synonyms:
US10301272, Example 8/7
Type:
Small organic molecule
Emp. Form.:
C30H36F3N3O4S
Mol. Mass.:
591.685
SMILES:
C[C@H](NC(=O)c1cc(cc(c1)C1(C)CC1)-c1sc(nc1CC1CCCCC1)C(=O)N[C@H]1C[C@@H](C1)C(O)=O)C(F)(F)F
: