Target
Thymidylate synthase
Ligand
BDBM50014505
Substrate
Meas. Tech.
ChEBML_209796
IC50
78±n/a nM
Citation
 Marsham, PRJackman, ALOldfield, JHughes, LRThornton, TJBisset, GMO'Connor, BMBishop, JACalvert, AH Quinazoline antifolate thymidylate synthase inhibitors: benzoyl ring modifications in the C2-methyl series. J Med Chem 33:3072-8 (1990)  
Target
Name:
Thymidylate synthase
Synonyms:
TS TYSY_MOUSE | Tyms
Type:
PROTEIN
Mol. Mass.:
34957.15
Organism:
Mus musculus
Description:
ChEMBL_1340097
Residue:
307
  
Inhibitor
Name:
BDBM50014505
Synonyms:
(S)-2-(2-fluoro-4-((2-hydroxyethyl)((2-methyl-4-oxo-3,4-dihydroquinazolin-6-yl)methyl)amino)benzamido)pentanedioic acid CHEMBL105425
Type:
Small organic molecule
Emp. Form.:
C24H25FN4O7
Mol. Mass.:
500.4763
SMILES:
Cc1nc2ccc(CN(CCO)c3ccc(C(=O)N[C@@H](CCC(O)=O)C(O)=O)c(F)c3)cc2c(=O)[nH]1
: