Target
Chymotrypsin-like elastase family member 1
Ligand
BDBM50014735
Substrate
Meas. Tech.
ChEBML_63628
Ki
1±n/a nM
Citation
 Peet, NPBurkhart, JPAngelastro, MRGiroux, ELMehdi, SBey, PKolb, MNeises, BSchirlin, D Synthesis of peptidyl fluoromethyl ketones and peptidyl alpha-keto esters as inhibitors of porcine pancreatic elastase, human neutrophil elastase, and rat and human neutrophil cathepsin G. J Med Chem 33:394-407 (1990)  
Target
Name:
Chymotrypsin-like elastase family member 1
Synonyms:
CELA1 ELA1 Elastase-1
Type:
PROTEIN
Mol. Mass.:
27805.35
Organism:
Homo sapiens (Human)
Description:
ChEMBL_63626
Residue:
258
  
Inhibitor
Name:
BDBM50014735
Synonyms:
(1-{1-Methyl-2-oxo-2-[2-(3,3,3-trifluoro-1-isopropyl-2-oxo-propylcarbamoyl)-pyrrolidin-1-yl]-ethylcarbamoyl}-ethyl)-carbamic acid benzyl ester | CHEMBL336171
Type:
Small organic molecule
Emp. Form.:
C25H33F3N4O6
Mol. Mass.:
542.5479
SMILES:
CC(C)[C@H](NC(=O)[C@@H]1CCCN1C(=O)[C@H](C)NC(=O)[C@H](C)NC(=O)OCc1ccccc1)C(=O)C(F)(F)F
: