Target
3-hydroxy-3-methylglutaryl-coenzyme A reductase
Ligand
BDBM50014823
Substrate
Meas. Tech.
ChEBML_80667
IC50
36±n/a nM
Citation
 Beck, GKesseler, KBaader, EBartmann, WBergmann, AGranzer, EJendralla, Hvon Kerekjarto, BKrause, RPaulus, E Synthesis and biological activity of new HMG-CoA reductase inhibitors. 1. Lactones of pyridine- and pyrimidine-substituted 3,5-dihydroxy-6-heptenoic (-heptanoic) acids. J Med Chem 33:52-60 (1990)  
Target
Name:
3-hydroxy-3-methylglutaryl-coenzyme A reductase
Synonyms:
HMDH_RAT Hmgcr
Type:
Enzyme
Mol. Mass.:
96689.85
Organism:
Rattus norvegicus (rat)
Description:
Isolated rat liver microsomes were used as enzyme source.
Residue:
887
  
Inhibitor
Name:
BDBM50014823
Synonyms:
(E)-4-Hydroxy-6-{2-[2-isopropyl-6-phenyl-4-(4-trifluoromethyl-phenyl)-pyridin-3-yl]-vinyl}-tetrahydro-pyran-2-one | CHEMBL2368193
Type:
Small organic molecule
Emp. Form.:
C28H26F3NO3
Mol. Mass.:
481.5061
SMILES:
CC(C)c1nc(cc(-c2ccc(cc2)C(F)(F)F)c1\C=C\[C@@H]1C[C@@H](O)CC(=O)O1)-c1ccccc1
: