Target
3-hydroxy-3-methylglutaryl-coenzyme A reductase
Ligand
BDBM50014828
Substrate
Meas. Tech.
ChEBML_80667
IC50
1±n/a nM
Citation
 Beck, GKesseler, KBaader, EBartmann, WBergmann, AGranzer, EJendralla, Hvon Kerekjarto, BKrause, RPaulus, E Synthesis and biological activity of new HMG-CoA reductase inhibitors. 1. Lactones of pyridine- and pyrimidine-substituted 3,5-dihydroxy-6-heptenoic (-heptanoic) acids. J Med Chem 33:52-60 (1990)  
Target
Name:
3-hydroxy-3-methylglutaryl-coenzyme A reductase
Synonyms:
HMDH_RAT Hmgcr
Type:
Enzyme
Mol. Mass.:
96689.85
Organism:
Rattus norvegicus (rat)
Description:
Isolated rat liver microsomes were used as enzyme source.
Residue:
887
  
Inhibitor
Name:
BDBM50014828
Synonyms:
(E)-6-{2-[2,4-Bis-(4-fluoro-phenyl)-6-isopropyl-pyrimidin-5-yl]-vinyl}-4-hydroxy-tetrahydro-pyran-2-one | CHEMBL2368185
Type:
Small organic molecule
Emp. Form.:
C26H24F2N2O3
Mol. Mass.:
450.4772
SMILES:
CC(C)c1nc(nc(-c2ccc(F)cc2)c1\C=C\[C@@H]1C[C@@H](O)CC(=O)O1)-c1ccc(F)cc1
: