Target
Cystathionine gamma-lyase
Ligand
BDBM50279943
Substrate
Meas. Tech.
ChEBML_1721616
IC50
6000±n/a nM
Citation
 Bhattacharjee, ASinha, ARatia, KYin, LDelgado-Rivera, LPetukhov, PAThatcher, GRJWardrop, DJ 2-Arylidene Hydrazinecarbodithioates as Potent, Selective Inhibitors of Cystathionine ?-Lyase (CSE). ACS Med Chem Lett 8:1241-1245 (2017)  
Target
Name:
Cystathionine gamma-lyase
Synonyms:
CGL_HUMAN Cystathionine gamma-lyase (CSE) Gamma-cystathionase
Type:
Protein
Mol. Mass.:
44509.52
Organism:
Homo sapiens (Human)
Description:
P32929
Residue:
405
  
Inhibitor
Name:
BDBM50279943
Synonyms:
CHEMBL4160479
Type:
Small organic molecule
Emp. Form.:
C8H9N3S2
Mol. Mass.:
211.307
SMILES:
CSC(=S)N\N=C\c1ccccn1
: