Target
Neutrophil elastase
Ligand
BDBM50015855
Substrate
Meas. Tech.
ChEBML_63806
IC50
40000±n/a nM
Citation
 Doherty, JBAshe, BMBarker, PLBlacklock, TJButcher, JWChandler, GODahlgren, MEDavies, PDorn, CPFinke, PE Inhibition of human leukocyte elastase. 1. Inhibition by C-7-substituted cephalosporin tert-butyl esters. J Med Chem 33:2513-21 (1990)  
Target
Name:
Neutrophil elastase
Synonyms:
Bone marrow serine protease Coagulation factor X ELANE Elastase HLE Leukocyte elastase Medullasin Neutrophil elastase (HNE) PMN elastase Trypsin
Type:
Enzyme
Mol. Mass.:
28532.38
Organism:
Homo sapiens (Human)
Description:
P08246
Residue:
267
  
Inhibitor
Name:
BDBM50015855
Synonyms:
3-Acetoxymethyl-7-ethoxy-5,8-dioxo-5lambda*4*-thia-1-aza-bicyclo[4.2.0]oct-2-ene-2-carboxylic acid tert-butyl ester | CHEMBL431591
Type:
Small organic molecule
Emp. Form.:
C16H23NO7S
Mol. Mass.:
373.421
SMILES:
CCO[C@@H]1[C@@H]2N(C1=O)C(C(=O)OC(C)(C)C)=C(COC(C)=O)CS2=O
: