Target
Genome polyprotein/Non-structural protein 4A
Ligand
BDBM50287595
Substrate
Meas. Tech.
ChEMBL_1729747 (CHEMBL4145025)
IC50
5.0±n/a nM
Citation
 Zheng, BD'Andrea, SVSun, LQWang, AXChen, YHrnciar, PFriborg, JFalk, PHernandez, DYu, FSheaffer, AKKnipe, JOMosure, KRajamani, RGood, ACKish, KTredup, JKlei, HEParuchuri, MNg, AGao, QRampulla, RAMathur, AMeanwell, NAMcPhee, FScola, PM Potent Inhibitors of Hepatitis C Virus NS3 Protease: Employment of a Difluoromethyl Group as a Hydrogen-Bond Donor. ACS Med Chem Lett 9:143-148 (2018)  
Target
Name:
Genome polyprotein/Non-structural protein 4A
Synonyms:
Hepatitis C virus serine protease, NS3/NS4A
Type:
Mol. Mass.:
Description:
ASSAY_ID of ChEMBL is 1969955
Components:
This complex has 2 components.
Component 1
Name:
Non-structural protein 4A
Synonyms:
Hepatitis C virus NS4A protein Non-structural protein 4A
Type:
PROTEIN
Mol. Mass.:
5762.65
Organism:
Hepatitis C virus
Description:
ChEMBL_305334
Residue:
54
  
Component 2
Name:
Genome polyprotein
Synonyms:
Hepatitis C virus NS3 protease/helicase | Hepatitis C virus serine protease, NS3/NS4A
Type:
Protein
Mol. Mass.:
67067.41
Organism:
Hepatitis C virus
Description:
A3EZI9
Residue:
631
  
Inhibitor
Name:
BDBM50287595
Synonyms:
CHEMBL3921126
Type:
Small organic molecule
Emp. Form.:
C35H48ClN5O9S
Mol. Mass.:
750.302
SMILES:
CC[C@@H]1C[C@]1(NC(=O)[C@@H]1C[C@H](CN1C(=O)[C@@H](NC(=O)OC(C)(C)C)C(C)(C)C)Oc1ncc(OC)c2ccc(Cl)cc12)C(=O)NS(=O)(=O)C1CC1
: