Target
Liver carboxylesterase 1
Ligand
BDBM50130915
Substrate
Meas. Tech.
ChEMBL_1731659 (CHEMBL4147195)
IC50
210±n/a nM
Citation
 Wu, YZZhang, HWSun, ZHDai, JGHu, YCLi, RLin, PCXia, GYWang, LYQiu, BLZhang, JFGe, GBLin, S Bysspectin A, an unusual octaketide dimer and the precursor derivatives from the endophytic fungus Byssochlamys spectabilis IMM0002 and their biological activities. Eur J Med Chem 145:717-725 (2018)  
Target
Name:
Liver carboxylesterase 1
Synonyms:
Acyl coenzyme A:cholesterol acyltransferase CES1 EST1_HUMAN Serine hydrolase (CES1)
Type:
Protein
Mol. Mass.:
62520.83
Organism:
Homo sapiens (Human)
Description:
Residue:
567
  
Inhibitor
Name:
BDBM50130915
Synonyms:
CHEBI:3122 | CHEMBL1231178
Type:
Small organic molecule
Emp. Form.:
C12H9N2O8P
Mol. Mass.:
340.1822
SMILES:
OP(=O)(Oc1ccc(cc1)[N+]([O-])=O)Oc1ccc(cc1)[N+]([O-])=O
: