Target
5-hydroxytryptamine receptor 1B
Ligand
BDBM50017456
Substrate
Meas. Tech.
ChEMBL_1791 (CHEMBL616764)
Ki
74±n/a nM
Citation
 Martin, GEElgin, RJMathiasen, JRDavis, CBKesslick, JMBaldy, WJShank, RPDiStefano, DLFedde, CLScott, MK Activity of aromatic substituted phenylpiperazines lacking affinity for dopamine binding sites in a preclinical test of antipsychotic efficacy. J Med Chem 32:1052-6 (1989)  
Target
Name:
5-hydroxytryptamine receptor 1B
Synonyms:
5-HT-1B 5-hydroxytryptamine receptor 1B (5HT1B) 5ht1b Serotonin 1 (5-HT1) receptor Serotonin receptor 1B
Type:
Protein
Mol. Mass.:
43173.33
Organism:
Rattus norvegicus (Rat)
Description:
P28564
Residue:
386
  
Inhibitor
Name:
BDBM50017456
Synonyms:
2-Piperazin-1-yl-phenol EN300-109720
Type:
Small organic molecule
Emp. Form.:
C10H14N2O
Mol. Mass.:
178.231
SMILES:
Oc1ccccc1N1CCNCC1
: