Target
Transcription initiation factor TFIID subunit 1
Ligand
BDBM50311438
Substrate
Meas. Tech.
ChEBML_1733135
IC50
>20000±n/a nM
Citation
 Xiang, QWang, CZhang, YXue, XSong, MZhang, CLi, CWu, CLi, KHui, XZhou, YSmaill, JBPatterson, AVWu, DDing, KXu, Y Discovery and optimization of 1-(1H-indol-1-yl)ethanone derivatives as CBP/EP300 bromodomain inhibitors for the treatment of castration-resistant prostate cancer. Eur J Med Chem 147:238-252 (2018)  
Target
Name:
Transcription initiation factor TFIID subunit 1
Synonyms:
BA2R CCG1 Cell cycle gene 1 protein TAF1 TAF2A TAFII250 Transcription initiation factor TFIID 250 kDa subunit p250
Type:
PROTEIN
Mol. Mass.:
212598.75
Organism:
Homo sapiens (Human)
Description:
ChEMBL_108248
Residue:
1872
  
Inhibitor
Name:
BDBM50311438
Synonyms:
CHEMBL4169942
Type:
Small organic molecule
Emp. Form.:
C24H24N2O6
Mol. Mass.:
436.4572
SMILES:
CC(=O)n1cc(C(=O)Nc2cc(COC3CCCCO3)cc(c2)C(O)=O)c2ccccc12
: