Target
Nuclear factor erythroid 2-related factor 2
Ligand
BDBM50321036
Substrate
Meas. Tech.
ChEMBL_1733956 (CHEMBL4149492)
IC50
<10.0±n/a nM
Citation
 Pallesen, JSTran, KTBach, A Non-covalent Small-Molecule Kelch-like ECH-Associated Protein 1-Nuclear Factor Erythroid 2-Related Factor 2 (Keap1-Nrf2) Inhibitors and Their Potential for Targeting Central Nervous System Diseases. J Med Chem 61:8088-8103 (2018)  
Target
Name:
Nuclear factor erythroid 2-related factor 2
Synonyms:
HEBP1 NF-E2-related factor 2 NFE2-related factor 2 NRF2 Nuclear factor, erythroid derived 2, like 2
Type:
PROTEIN
Mol. Mass.:
67786.89
Organism:
Homo sapiens (Human)
Description:
ChEMBL_107924
Residue:
605
  
Inhibitor
Name:
BDBM50321036
Synonyms:
CHEMBL4160447
Type:
Small organic molecule
Emp. Form.:
C30H33N5O3
Mol. Mass.:
511.6147
SMILES:
C[C@H](Oc1cccc(c1)-c1cccc(c1)-n1ncc(C(O)=O)c1[C@@H]1C[C@H]1c1cn(C)nn1)C1CCCCC1
: