Target
Carbonic anhydrase 4
Ligand
BDBM50369730
Substrate
Meas. Tech.
ChEMBL_1737219 (CHEMBL4152969)
Ki
2.3±n/a nM
Citation
 Chiaramonte, NBua, SFerraroni, MNocentini, ABonardi, ABartolucci, GDurante, MLucarini, LChiapponi, DDei, SManetti, DTeodori, EGratteri, PMasini, ESupuran, CTRomanelli, MN 2-Benzylpiperazine: A new scaffold for potent human carbonic anhydrase inhibitors. Synthesis, enzyme inhibition, enantioselectivity, computational and crystallographic studies and in vivo activity for a new class of intraocular pressure lowering agents. Eur J Med Chem 151:363-375 (2018)  
Target
Name:
Carbonic anhydrase 4
Synonyms:
CA-IV CAH4_HUMAN Carbonic anhydrase Carbonic anhydrase IV (CA IV)
Type:
Enzyme
Mol. Mass.:
35037.98
Organism:
Homo sapiens (Human)
Description:
P22748
Residue:
312
  
Inhibitor
Name:
BDBM50369730
Synonyms:
CHEMBL4164109
Type:
Small organic molecule
Emp. Form.:
C25H27N3O3S
Mol. Mass.:
449.565
SMILES:
NS(=O)(=O)c1ccc(cc1)C(=O)N1CCN(Cc2ccccc2)[C@H](Cc2ccccc2)C1
: