Target
Tyrosyl-DNA phosphodiesterase 2
Ligand
BDBM50378135
Substrate
Meas. Tech.
ChEMBL_1737947 (CHEMBL4153697)
IC50
20000±n/a nM
Citation
 Yu, LMHu, ZChen, YRavji, ALopez, SPlescia, CBYu, QYang, HAbdelmalak, MSaha, SAgama, KKiselev, EMarchand, CPommier, YAn, LK Synthesis and structure-activity relationship of furoquinolinediones as inhibitors of Tyrosyl-DNA phosphodiesterase 2 (TDP2). Eur J Med Chem 151:777-796 (2018)  
Target
Name:
Tyrosyl-DNA phosphodiesterase 2
Synonyms:
EAP2 ETS1-associated protein 2 TDP2 TTRAP Tyr-DNA phosphodiesterase 2 Tyrosyl-DNA phosphodiesterase 2 (hTDP2) VPg unlinkase | hTDP2
Type:
Enzyme Catalytic Domain
Mol. Mass.:
40916.54
Organism:
Homo sapiens (Human)
Description:
gi_23510348
Residue:
362
  
Inhibitor
Name:
BDBM50378135
Synonyms:
CHEMBL4165434
Type:
Small organic molecule
Emp. Form.:
C16H13NO7
Mol. Mass.:
331.2769
SMILES:
Cc1oc2c(c1C(=O)OCC(O)CO)C(=O)c1ncccc1C2=O
: