Target
Dihydrofolate reductase
Ligand
BDBM50018475
Substrate
Meas. Tech.
ChEMBL_54744 (CHEMBL667195)
Ki
1±n/a nM
Citation
 Roth, BTidwell, MYFerone, RBaccanari, DPSigel, CWDeAngelis, DElwell, LP 2,4-Diamino-5-benzylpyrimidines as antibacterial agents. 13. Some alkenyl derivatives with high in vitro activity against anaerobic organisms. J Med Chem 32:1949-58 (1989)  
Target
Name:
Dihydrofolate reductase
Synonyms:
Dihydrofolate reductase (F31V) | dfrA17
Type:
Mol. Mass.:
17532.46
Organism:
Escherichia coli
Description:
Residue:
157
  
Inhibitor
Name:
BDBM50018475
Synonyms:
5-(3,4-Dimethoxy-5-propoxy-benzyl)-pyrimidine-2,4-diamine TCMDC-137661
Type:
Small organic molecule
Emp. Form.:
C16H22N4O3
Mol. Mass.:
318.3709
SMILES:
CCCOc1cc(Cc2cnc(N)nc2N)cc(OC)c1OC
: