Target
Alpha-1A adrenergic receptor
Ligand
BDBM50018738
Substrate
Meas. Tech.
ChEMBL_33091 (CHEMBL643583)
Ki
540±n/a nM
Citation
 Huff, JRBaldwin, JJdeSolms, SJGuare, JPHunt, CARandall, WCSanders, WSSmith, SJVacca, JPZrada, MM Structure-affinity relationships of arylquinolizines at alpha-adrenoceptors. J Med Chem 31:641-5 (1988)  
Target
Name:
Alpha-1A adrenergic receptor
Synonyms:
ADA1A_BOVIN ADRA1C Alpha 1A-adrenoreceptor Cerebral cortex alpha adrenergic receptor | adrenergic Alpha1
Type:
Enzyme Catalytic Domain
Mol. Mass.:
51492.08
Organism:
CALF
Description:
adrenergic Alpha1 0 CALF
Residue:
466
  
Inhibitor
Name:
BDBM50018738
Synonyms:
1,2,3,4,5,6,11,11b-Octahydro-4a,10,11-triaza-benzo[a]fluorene | CHEMBL345621
Type:
Small organic molecule
Emp. Form.:
C14H17N3
Mol. Mass.:
227.3049
SMILES:
C1CCN2CCc3c([nH]c4ncccc34)C2C1
: