Target
Alpha-2A adrenergic receptor
Ligand
BDBM50018738
Substrate
Meas. Tech.
ChEMBL_33042 (CHEMBL858268)
Ki
661±n/a nM
Citation
 Huff, JRBaldwin, JJdeSolms, SJGuare, JPHunt, CARandall, WCSanders, WSSmith, SJVacca, JPZrada, MM Structure-affinity relationships of arylquinolizines at alpha-adrenoceptors. J Med Chem 31:641-5 (1988)  
Target
Name:
Alpha-2A adrenergic receptor
Synonyms:
ADA2A_BOVIN Alpha-2A adrenergic receptor Alpha-2A adrenoreceptor Alpha-2D adrenergic receptor Cerebral cortex alpha adrenergic receptor adrenergic Alpha2D
Type:
Enzyme Catalytic Domain
Mol. Mass.:
49275.13
Organism:
BOVINE
Description:
adrenergic Alpha2 0 BOVINE::Q28838
Residue:
452
  
Inhibitor
Name:
BDBM50018738
Synonyms:
1,2,3,4,5,6,11,11b-Octahydro-4a,10,11-triaza-benzo[a]fluorene | CHEMBL345621
Type:
Small organic molecule
Emp. Form.:
C14H17N3
Mol. Mass.:
227.3049
SMILES:
C1CCN2CCc3c([nH]c4ncccc34)C2C1
: