Target
Sodium channel protein type 9 subunit alpha
Ligand
BDBM50450581
Substrate
Meas. Tech.
ChEMBL_1742885 (CHEMBL4158635)
IC50
5.4±n/a nM
Citation
 Wu, BMurray, JKAndrews, KLSham, KLong, JAral, JLigutti, JAmagasu, SLiu, DZou, AMin, XWang, ZIlch, CPKornecook, TJLin, MJBe, XMiranda, LPMoyer, BDBiswas, K Discovery of Tarantula Venom-Derived Na J Med Chem 61:9500-9512 (2018)  
Target
Name:
Sodium channel protein type 9 subunit alpha
Synonyms:
Kiaa4197 Peripheral sodium channel 1 Scn9a Sodium channel protein type IX subunit alpha | Voltage-gated sodium channel subunit alpha Nav1.7
Type:
PROTEIN
Mol. Mass.:
225808.99
Organism:
Mus musculus
Description:
ChEMBL_109594
Residue:
1984
  
Inhibitor
Name:
BDBM50450581
Synonyms:
CHEMBL4159169
Type:
Small organic molecule
Emp. Form.:
C155H236BrN47O41S6
Mol. Mass.:
3686.117
SMILES:
CCCC[C@@H]1NC(=O)[C@H](Cc2c[nH]c3ccccc23)NC(=O)[C@H](CCCCN)NC(=O)[C@H](CCC(N)=O)NC(=O)[C@H](CSSC[C@@H]2NC(=O)[C@@H]3CSSC[C@H](NC(=O)[C@H](Cc4c[nH]c5ccc(Br)cc45)NC(=O)[C@H](CC(C)C)NC(=O)[C@H](CCCCN)NC(=O)[C@H](CSSC[C@H](NC(=O)[C@@H](NC(=O)[C@H](Cc4c[nH]c5ccccc45)NC1=O)[C@@H](C)O)C(=O)N[C@@H](CC(O)=O)C(=O)N[C@@H](CO)C(=O)N[C@@H](C)C(=O)N[C@@H](CCCNC(N)=N)C(=O)N[C@@H](C)C(=O)N3)NC(=O)[C@H](CCCNC(N)=N)NC(=O)[C@H](CC(C)C)NC(=O)CNC(=O)[C@H](CCC(O)=O)NC2=O)C(=O)N[C@@H](CCCNC(N)=N)C(=O)N[C@@H](CCCCN)C(=O)N[C@@H](CCC(O)=O)C(=O)N[C@@H]([C@@H](C)CC)C(N)=O)NC(=O)[C@H](CC#C)NC(=O)[C@@H](N)CCC(O)=O
: