Target
Capsid protein
Ligand
BDBM50088372
Substrate
Meas. Tech.
ChEMBL_1743345 (CHEMBL4177855)
EC50
819±n/a nM
Citation
 Ren, QLiu, XLuo, ZLi, JWang, CGoldmann, SZhang, JZhang, Y Discovery of hepatitis B virus capsid assembly inhibitors leading to a heteroaryldihydropyrimidine based clinical candidate (GLS4). Bioorg Med Chem 25:1042-1056 (2017)  
Target
Name:
Capsid protein
Synonyms:
Core antigen
Type:
PROTEIN
Mol. Mass.:
26278.39
Organism:
Hepatitis B virus
Description:
ChEMBL_450484
Residue:
230
  
Inhibitor
Name:
BDBM50088372
Synonyms:
CHEBI:63624 Sebivo Tyzeka
Type:
Small organic molecule
Emp. Form.:
C10H14N2O5
Mol. Mass.:
242.2286
SMILES:
Cc1cn([C@@H]2C[C@@H](O)[C@H](CO)O2)c(=O)[nH]c1=O
: