Target
Glutamate receptor ionotropic, NMDA 2C
Ligand
BDBM83449
Substrate
Meas. Tech.
ChEBML_154849
Ki
60±n/a nM
Citation
 Thurkauf, AHillery, PMattson, MVJacobson, AERice, KC Synthesis, pharmacological action, and receptor binding affinity of the enantiomeric 1-(1-phenyl-3-methylcyclohexyl)piperidines. J Med Chem 31:1625-8 (1988)  
Target
Name:
Glutamate receptor ionotropic, NMDA 2C
Synonyms:
Glutamate NMDA receptor; Grin1/Grin2c Grin2c NMDE3_RAT
Type:
Protein
Mol. Mass.:
135305.94
Organism:
Rattus norvegicus (Rat)
Description:
Q00961
Residue:
1237
  
Inhibitor
Name:
BDBM83449
Synonyms:
1-(1-phenylcyclohexyl)piperidine;hydrochloride PCP PHENCYCLIDINE SMR001338811 | cid_9795678
Type:
Small organic molecule
Emp. Form.:
C17H25N
Mol. Mass.:
243.3871
SMILES:
C1CCN(CC1)C1(CCCCC1)c1ccccc1
: