Target
Rap guanine nucleotide exchange factor 3
Ligand
BDBM50098793
Substrate
Meas. Tech.
ChEMBL_1743822 (CHEMBL4178332)
IC50
2400±n/a nM
Citation
 Wang, PLiu, ZChen, HYe, NCheng, XZhou, J Exchange proteins directly activated by cAMP (EPACs): Emerging therapeutic targets. Bioorg Med Chem Lett 27:1633-1639 (2017)  
Target
Name:
Rap guanine nucleotide exchange factor 3
Synonyms:
CGEF1 EPAC 1 Exchange factor directly activated by cAMP 1 RAPGEF3 Rap1 guanine-nucleotide-exchange factor directly activated by cAMP cAMP-regulated guanine nucleotide exchange factor I
Type:
PROTEIN
Mol. Mass.:
103769.52
Organism:
Homo sapiens (Human)
Description:
ChEMBL_104531
Residue:
923
  
Inhibitor
Name:
BDBM50098793
Synonyms:
CHEMBL3593342
Type:
Small organic molecule
Emp. Form.:
C16H13Cl3N4O2
Mol. Mass.:
399.659
SMILES:
CC(C)(C)c1cc(no1)C(=O)C(=N\Nc1cc(Cl)c(Cl)c(Cl)c1)\C#N
: