Target
Rap guanine nucleotide exchange factor 4
Ligand
BDBM50452008
Substrate
Meas. Tech.
ChEMBL_1746760 (CHEMBL4181270)
IC50
2500±n/a nM
Citation
 Liu, ZZhu, YChen, HWang, PMei, FCYe, NCheng, XZhou, J Structure-activity relationships of 2-substituted phenyl-N-phenyl-2-oxoacetohydrazonoyl cyanides as novel antagonists of exchange proteins directly activated by cAMP (EPACs). Bioorg Med Chem Lett 27:5163-5166 (2017)  
Target
Name:
Rap guanine nucleotide exchange factor 4
Synonyms:
CGEF2 EPAC2 Exchange protein directly activated by cAMP 2 RPGF4_HUMAN cAMP-regulated guanine nucleotide exchange factor II
Type:
PROTEIN
Mol. Mass.:
115526.83
Organism:
Homo sapiens (Human)
Description:
ChEMBL_1504794
Residue:
1011
  
Inhibitor
Name:
BDBM50452008
Synonyms:
CHEMBL4214692
Type:
Small organic molecule
Emp. Form.:
C19H11Cl2N3O
Mol. Mass.:
368.216
SMILES:
Clc1cc(Cl)cc(N\N=C(/C#N)C(=O)c2ccc3ccccc3c2)c1
: