Target
CREB-binding protein
Ligand
BDBM50453970
Substrate
Meas. Tech.
ChEMBL_1751625 (CHEMBL4186385)
IC50
2.8±n/a nM
Citation
 Lai, KWRomero, FATsui, VBeresini, MHde Leon Boenig, GBronner, SMChen, KChen, ZChoo, EFCrawford, TDCyr, PKaufman, SLi, YLiao, JLiu, WLy, JMurray, JShen, WWai, JWang, FZhu, CZhu, XMagnuson, S Design and synthesis of a biaryl series as inhibitors for the bromodomains of CBP/P300. Bioorg Med Chem Lett 28:15-23 (2018)  
Target
Name:
CREB-binding protein
Synonyms:
CBP CREB-binding protein (CBP) CREBBP
Type:
Transcription Coactivator
Mol. Mass.:
265411.66
Organism:
Homo sapiens (Human)
Description:
Q92793
Residue:
2442
  
Inhibitor
Name:
BDBM50453970
Synonyms:
CHEMBL4207965 | US11247989, Example 98
Type:
Small organic molecule
Emp. Form.:
C27H28F2N6O2
Mol. Mass.:
506.547
SMILES:
CC(=O)N1CCc2c(C1)c(nn2C1CCOCC1)-c1cccc2cc(ncc12)-c1cnn(C)c1C(F)F
: