Target
5-hydroxytryptamine receptor 1A
Ligand
BDBM50020582
Substrate
Meas. Tech.
ChEMBL_568 (CHEMBL884524)
IC50
2.4±n/a nM
Citation
 Chumpradit, SKung, HFBillings, JGuo, YZWu, YShih, J Preparation and biodistribution of 1-[2-(3-[125I]iodo-4-aminophenyl)ethyl]-4-[3-(trifluoromethyl) phenyl]piperazine and 1-[2-(3-[125I]iodo-4-azidophenyl)ethyl]-4-[3-(trifluoromethyl)phenyl] piperazine. J Med Chem 32:543-7 (1989)  
Target
Name:
5-hydroxytryptamine receptor 1A
Synonyms:
5-HT-1A 5-hydroxytryptamine receptor 1A (5-HT-1A) ADRB2RL1 Dopamine D2 receptor and serotonin 1a receptor HTR1A | Serotonin receptor 1A
Type:
Mol. Mass.:
46122.49
Organism:
Homo sapiens (Human)
Description:
Residue:
422
  
Inhibitor
Name:
BDBM50020582
Synonyms:
CHEMBL284820 | Dipropyl-(1,2,3,4-tetrahydro-naphthalen-2-yl)-amine
Type:
Small organic molecule
Emp. Form.:
C16H25N
Mol. Mass.:
231.3764
SMILES:
CCCN(CCC)C1CCc2ccccc2C1
: