Target
5-hydroxytryptamine receptor 1A
Ligand
BDBM50020579
Substrate
Meas. Tech.
ChEMBL_583 (CHEMBL615453)
Ki
4±n/a nM
Citation
 Chumpradit, SKung, HFBillings, JGuo, YZWu, YShih, J Preparation and biodistribution of 1-[2-(3-[125I]iodo-4-aminophenyl)ethyl]-4-[3-(trifluoromethyl) phenyl]piperazine and 1-[2-(3-[125I]iodo-4-azidophenyl)ethyl]-4-[3-(trifluoromethyl)phenyl] piperazine. J Med Chem 32:543-7 (1989)  
Target
Name:
5-hydroxytryptamine receptor 1A
Synonyms:
5-HT-1A 5-hydroxytryptamine receptor 1A (5-HT-1A) ADRB2RL1 Dopamine D2 receptor and serotonin 1a receptor HTR1A | Serotonin receptor 1A
Type:
Mol. Mass.:
46122.49
Organism:
Homo sapiens (Human)
Description:
Residue:
422
  
Inhibitor
Name:
BDBM50020579
Synonyms:
3-{2-[4-(3-Trifluoromethyl-phenyl)-piperazin-1-yl]-ethyl}-phenylamine | CHEMBL423045
Type:
Small organic molecule
Emp. Form.:
C19H22F3N3
Mol. Mass.:
349.3933
SMILES:
Nc1cccc(CCN2CCN(CC2)c2cccc(c2)C(F)(F)F)c1
: