Target
Angiotensin-converting enzyme
Ligand
BDBM50021124
Substrate
Meas. Tech.
ChEMBL_34933 (CHEMBL647678)
pH
7.5±n/a
Ki
2.6±n/a nM
Comments
extracted
Citation
 Galardy, REGrobelny, D N alpha-(diphenoxyphosphoryl)-L-alanyl-L-proline, N alpha-[bis (4-nitrophenoxy)phosphoryl]-L-alanyl-L-proline, and N alpha-[ (2-phenylethyl)phenoxyphosphoryl]-L-alanyl-L-proline: releasers of potent inhibitors of angiotensin converting enzyme at physiological pH and temperature. J Med Chem 28:1422-7 (1985)  
Target
Name:
Angiotensin-converting enzyme
Synonyms:
3.2.1.- ACE Angiotensin-converting enzyme, soluble form DCP1 Kininase II
Type:
Mol. Mass.:
150405.15
Organism:
Oryctolagus cuniculus
Description:
Residue:
1310
  
Inhibitor
Name:
BDBM50021124
Synonyms:
CHEMBL34402 | dipotassium (2S)-1-{(2S)-2-[(methoxyphosphinato)amino]propanoyl}pyrrolidine-2-carboxylate
Type:
Small organic molecule
Emp. Form.:
C9H15N2O6P
Mol. Mass.:
278.2001
SMILES:
COP([O-])(=O)N[C@@H](C)C(=O)N1CCC[C@H]1C([O-])=O
: