Target
Angiotensin-converting enzyme
Ligand
BDBM50021116
Substrate
Meas. Tech.
ChEMBL_34909 (CHEMBL648445)
pH
8±n/a
IC50
170000000±n/a nM
Comments
extracted
Citation
 Galardy, REGrobelny, D N alpha-(diphenoxyphosphoryl)-L-alanyl-L-proline, N alpha-[bis (4-nitrophenoxy)phosphoryl]-L-alanyl-L-proline, and N alpha-[ (2-phenylethyl)phenoxyphosphoryl]-L-alanyl-L-proline: releasers of potent inhibitors of angiotensin converting enzyme at physiological pH and temperature. J Med Chem 28:1422-7 (1985)  
Target
Name:
Angiotensin-converting enzyme
Synonyms:
3.2.1.- ACE Angiotensin-converting enzyme, soluble form DCP1 Kininase II
Type:
Mol. Mass.:
150405.15
Organism:
Oryctolagus cuniculus
Description:
Residue:
1310
  
Inhibitor
Name:
BDBM50021116
Synonyms:
CHEMBL33124 | dipotassium (2S)-1-{(2S)-2-[(phenoxyphosphinato)amino]propanoyl}pyrrolidine-2-carboxylate
Type:
Small organic molecule
Emp. Form.:
C14H17N2O6P
Mol. Mass.:
340.2694
SMILES:
C[C@H](NP([O-])(=O)Oc1ccccc1)C(=O)N1CCC[C@H]1C([O-])=O
: