Target
Gamma-aminobutyric acid receptor subunit gamma-1
Ligand
BDBM24183
Substrate
Meas. Tech.
ChEBML_68602
IC50
33±n/a nM
Citation
 Krogsgaard-Larsen, PNielsen, LFalch, ECurtis, DR GABA agonists. Resolution, absolute stereochemistry, and enantioselectivity of (S)-(+)- and (R)-(-)-dihydromuscimol. J Med Chem 28:1612-7 (1985)  
Target
Name:
Gamma-aminobutyric acid receptor subunit gamma-1
Synonyms:
Benzodiazepine receptors GABA receptor gamma-1 subunit Gabrg1
Type:
PROTEIN
Mol. Mass.:
53557.84
Organism:
Rattus norvegicus
Description:
ChEMBL_193817
Residue:
465
  
Inhibitor
Name:
BDBM24183
Synonyms:
4-amino-n-[2,3-3H]butyric acid Aminalon GABA [3H]GABA | cid_119
Type:
Radiolabeled ligand
Emp. Form.:
C4H9NO2
Mol. Mass.:
103.1198
SMILES:
NCCCC(O)=O
: